iotests: Fix "no qualified output" error path
diff mbox series

Message ID 20191108085713.27551-1-kwolf@redhat.com
State New
Headers show
Series
  • iotests: Fix "no qualified output" error path
Related show

Commit Message

Kevin Wolf Nov. 8, 2019, 8:57 a.m. UTC
The variable for error messages to be displayed is $results, not
$reason. Fix 'check' to print the "no qualified output" error message
again instead of having a failure without any message telling the user
why it failed.

Signed-off-by: Kevin Wolf <kwolf@redhat.com>
---
 tests/qemu-iotests/check | 2 +-
 1 file changed, 1 insertion(+), 1 deletion(-)

Comments

Max Reitz Nov. 8, 2019, 10:04 a.m. UTC | #1
On 08.11.19 09:57, Kevin Wolf wrote:
> The variable for error messages to be displayed is $results, not
> $reason. Fix 'check' to print the "no qualified output" error message
> again instead of having a failure without any message telling the user
> why it failed.
> 
> Signed-off-by: Kevin Wolf <kwolf@redhat.com>
> ---
>  tests/qemu-iotests/check | 2 +-
>  1 file changed, 1 insertion(+), 1 deletion(-)

Reviewed-by: Max Reitz <mreitz@redhat.com>
no-reply@patchew.org Nov. 8, 2019, 11:24 a.m. UTC | #2
Patchew URL: https://patchew.org/QEMU/20191108085713.27551-1-kwolf@redhat.com/



Hi,

This series failed the docker-quick@centos7 build test. Please find the testing commands and
their output below. If you have Docker installed, you can probably reproduce it
locally.

=== TEST SCRIPT BEGIN ===
#!/bin/bash
make docker-image-centos7 V=1 NETWORK=1
time make docker-test-quick@centos7 SHOW_ENV=1 J=14 NETWORK=1
=== TEST SCRIPT END ===

  TEST    iotest-qcow2: 268
Failures: 192
Failed 1 of 108 iotests
make: *** [check-tests/check-block.sh] Error 1
Traceback (most recent call last):
  File "./tests/docker/docker.py", line 662, in <module>
    sys.exit(main())
---
    raise CalledProcessError(retcode, cmd)
subprocess.CalledProcessError: Command '['sudo', '-n', 'docker', 'run', '--label', 'com.qemu.instance.uuid=414a771dbd814a1183fd7732b0c1f2c5', '-u', '1001', '--security-opt', 'seccomp=unconfined', '--rm', '-e', 'TARGET_LIST=', '-e', 'EXTRA_CONFIGURE_OPTS=', '-e', 'V=', '-e', 'J=14', '-e', 'DEBUG=', '-e', 'SHOW_ENV=1', '-e', 'CCACHE_DIR=/var/tmp/ccache', '-v', '/home/patchew/.cache/qemu-docker-ccache:/var/tmp/ccache:z', '-v', '/var/tmp/patchew-tester-tmp-g2muu7fm/src/docker-src.2019-11-08-06.10.38.10992:/var/tmp/qemu:z,ro', 'qemu:centos7', '/var/tmp/qemu/run', 'test-quick']' returned non-zero exit status 2.
filter=--filter=label=com.qemu.instance.uuid=414a771dbd814a1183fd7732b0c1f2c5
make[1]: *** [docker-run] Error 1
make[1]: Leaving directory `/var/tmp/patchew-tester-tmp-g2muu7fm/src'
make: *** [docker-run-test-quick@centos7] Error 2

real    13m23.714s
user    0m9.033s


The full log is available at
http://patchew.org/logs/20191108085713.27551-1-kwolf@redhat.com/testing.docker-quick@centos7/?type=message.
---
Email generated automatically by Patchew [https://patchew.org/].
Please send your feedback to patchew-devel@redhat.com

Patch
diff mbox series

diff --git a/tests/qemu-iotests/check b/tests/qemu-iotests/check
index 588c453a94..5218728470 100755
--- a/tests/qemu-iotests/check
+++ b/tests/qemu-iotests/check
@@ -876,7 +876,7 @@  do
             if [ ! -f "$reference" ]
             then
                 status="fail"
-                reason="no qualified output"
+                results="no qualified output"
                 err=true
             else
                 if diff -w "$reference" $tmp.out >/dev/null 2>&1