diff mbox series

tests/venv: force compatible avocado-framework-plugin-result-html version

Message ID 20200928100902.28638-1-kraxel@redhat.com
State New, archived
Headers show
Series tests/venv: force compatible avocado-framework-plugin-result-html version | expand

Commit Message

Gerd Hoffmann Sept. 28, 2020, 10:09 a.m. UTC
Without this avocado doesn't start in case an incompatible
avocado-framework-plugin-result-html version happens to be installed
in system (/usr/lib) or user ($HOME/.local/lib) directory.

Signed-off-by: Gerd Hoffmann <kraxel@redhat.com>
---
 tests/requirements.txt | 1 +
 1 file changed, 1 insertion(+)

Comments

no-reply@patchew.org Sept. 28, 2020, 11:08 a.m. UTC | #1
Patchew URL: https://patchew.org/QEMU/20200928100902.28638-1-kraxel@redhat.com/



Hi,

This series failed the docker-quick@centos7 build test. Please find the testing commands and
their output below. If you have Docker installed, you can probably reproduce it
locally.

=== TEST SCRIPT BEGIN ===
#!/bin/bash
make docker-image-centos7 V=1 NETWORK=1
time make docker-test-quick@centos7 SHOW_ENV=1 J=14 NETWORK=1
=== TEST SCRIPT END ===

C linker for the host machine: cc ld.bfd 2.27-43
Host machine cpu family: x86_64
Host machine cpu: x86_64
../src/meson.build:10: WARNING: Module unstable-keyval has no backwards or forwards compatibility and might not exist in future releases.
Program sh found: YES
Program python3 found: YES (/usr/bin/python3)
Configuring ninjatool using configuration
---
qemu-system-aarch64: cannot set up guest memory 'sbsa-ref.ram': Cannot allocate memory
Broken pipe
../src/tests/qtest/libqtest.c:166: kill_qemu() tried to terminate QEMU process but encountered exit status 1 (expected 0)
ERROR qtest-aarch64: test-hmp - too few tests run (expected 72, got 12)
make: *** [run-test-171] Error 1
make: *** Waiting for unfinished jobs....
Could not access KVM kernel module: No such file or directory
qemu-system-x86_64: -accel kvm: failed to initialize kvm: No such file or directory
---
    raise CalledProcessError(retcode, cmd)
subprocess.CalledProcessError: Command '['sudo', '-n', 'docker', 'run', '--rm', '--label', 'com.qemu.instance.uuid=46ef320d9ade455bb81a94e24d006139', '-u', '1001', '--security-opt', 'seccomp=unconfined', '-e', 'TARGET_LIST=', '-e', 'EXTRA_CONFIGURE_OPTS=', '-e', 'V=', '-e', 'J=14', '-e', 'DEBUG=', '-e', 'SHOW_ENV=1', '-e', 'CCACHE_DIR=/var/tmp/ccache', '-v', '/home/patchew/.cache/qemu-docker-ccache:/var/tmp/ccache:z', '-v', '/var/tmp/patchew-tester-tmp-f7kja_yg/src/docker-src.2020-09-28-06.50.05.12425:/var/tmp/qemu:z,ro', 'qemu/centos7', '/var/tmp/qemu/run', 'test-quick']' returned non-zero exit status 2.
filter=--filter=label=com.qemu.instance.uuid=46ef320d9ade455bb81a94e24d006139
make[1]: *** [docker-run] Error 1
make[1]: Leaving directory `/var/tmp/patchew-tester-tmp-f7kja_yg/src'
make: *** [docker-run-test-quick@centos7] Error 2

real    17m58.097s
user    0m21.868s


The full log is available at
http://patchew.org/logs/20200928100902.28638-1-kraxel@redhat.com/testing.docker-quick@centos7/?type=message.
---
Email generated automatically by Patchew [https://patchew.org/].
Please send your feedback to patchew-devel@redhat.com
diff mbox series

Patch

diff --git a/tests/requirements.txt b/tests/requirements.txt
index 036691c92215..a78cc5c19972 100644
--- a/tests/requirements.txt
+++ b/tests/requirements.txt
@@ -2,4 +2,5 @@ 
 # in the tests/venv Python virtual environment. For more info,
 # refer to: https://pip.pypa.io/en/stable/user_guide/#id1
 avocado-framework==81.0
+avocado-framework-plugin-result-html==81.0
 pycdlib==1.9.0