mbox

[PULL,0/5] Usb 20200928 patches

Message ID 20200928131638.9486-1-kraxel@redhat.com
State New, archived
Headers show

Pull-request

git://git.kraxel.org/qemu tags/usb-20200928-pull-request

Message

Gerd Hoffmann Sept. 28, 2020, 1:16 p.m. UTC
The following changes since commit 8d16e72f2d4df2c9e631393adf1669a1da7efe8a:

  Merge remote-tracking branch 'remotes/dgilbert/tags/pull-migration-20200925a' into staging (2020-09-25 14:46:18 +0100)

are available in the Git repository at:

  git://git.kraxel.org/qemu tags/usb-20200928-pull-request

for you to fetch changes up to 5c43b603a2e3f77f41e0cf339e72bee2077bfe61:

  hw/usb: Use lock guard macros (2020-09-28 13:13:58 +0200)

----------------------------------------------------------------
usb: xhci sysbus support.
usb: use lock guards.

----------------------------------------------------------------

Amey Narkhede (1):
  hw/usb: Use lock guard macros

Sai Pavan Boddu (4):
  usb/hcd-xhci: Make dma read/writes hooks pci free
  usb/hcd-xhci: Move qemu-xhci device to hcd-xhci-pci.c
  usb/hcd-xhci: Split pci wrapper for xhci base model
  usb: hcd-xhci-sysbus: Attach xhci to sysbus device

 hw/usb/hcd-xhci-pci.h       |  44 ++++++
 hw/usb/hcd-xhci-sysbus.h    |  32 +++++
 hw/usb/hcd-xhci.h           |  21 ++-
 hw/usb/ccid-card-emulated.c |  54 +++----
 hw/usb/hcd-xhci-nec.c       |  18 +--
 hw/usb/hcd-xhci-pci.c       | 261 ++++++++++++++++++++++++++++++++++
 hw/usb/hcd-xhci-sysbus.c    | 109 +++++++++++++++
 hw/usb/hcd-xhci.c           | 271 ++++++++----------------------------
 hw/usb/Kconfig              |  11 ++
 hw/usb/meson.build          |   2 +
 10 files changed, 564 insertions(+), 259 deletions(-)
 create mode 100644 hw/usb/hcd-xhci-pci.h
 create mode 100644 hw/usb/hcd-xhci-sysbus.h
 create mode 100644 hw/usb/hcd-xhci-pci.c
 create mode 100644 hw/usb/hcd-xhci-sysbus.c

Comments

no-reply@patchew.org Sept. 28, 2020, 6:26 p.m. UTC | #1
Patchew URL: https://patchew.org/QEMU/20200928131638.9486-1-kraxel@redhat.com/



Hi,

This series failed the docker-quick@centos7 build test. Please find the testing commands and
their output below. If you have Docker installed, you can probably reproduce it
locally.

=== TEST SCRIPT BEGIN ===
#!/bin/bash
make docker-image-centos7 V=1 NETWORK=1
time make docker-test-quick@centos7 SHOW_ENV=1 J=14 NETWORK=1
=== TEST SCRIPT END ===

C linker for the host machine: cc ld.bfd 2.27-43
Host machine cpu family: x86_64
Host machine cpu: x86_64
../src/meson.build:10: WARNING: Module unstable-keyval has no backwards or forwards compatibility and might not exist in future releases.
Program sh found: YES
Program python3 found: YES (/usr/bin/python3)
Configuring ninjatool using configuration
---
qemu-system-aarch64: cannot set up guest memory 'sbsa-ref.ram': Cannot allocate memory
Broken pipe
../src/tests/qtest/libqtest.c:166: kill_qemu() tried to terminate QEMU process but encountered exit status 1 (expected 0)
ERROR qtest-aarch64: test-hmp - too few tests run (expected 72, got 12)
make: *** [run-test-171] Error 1
make: *** Waiting for unfinished jobs....
Looking for expected file 'tests/data/acpi/virt/GTDT'
Using expected file 'tests/data/acpi/virt/GTDT'
---
Using expected file 'tests/data/acpi/virt/DSDT'
socket_accept failed: Resource temporarily unavailable
**
ERROR:../src/tests/qtest/libqtest.c:301:qtest_init_without_qmp_handshake: assertion failed: (s->fd >= 0 && s->qmp_fd >= 0)
../src/tests/qtest/libqtest.c:166: kill_qemu() tried to terminate QEMU process but encountered exit status 1 (expected 0)
ERROR qtest-x86_64: bios-tables-test - Bail out! ERROR:../src/tests/qtest/libqtest.c:301:qtest_init_without_qmp_handshake: assertion failed: (s->fd >= 0 && s->qmp_fd >= 0)
make: *** [run-test-138] Error 1
  TEST    iotest-qcow2: 013

Looking for expected file 'tests/data/acpi/virt/FACP.numamem'
---
  TEST    iotest-qcow2: 018
socket_accept failed: Resource temporarily unavailable
**
ERROR:../src/tests/qtest/libqtest.c:301:qtest_init_without_qmp_handshake: assertion failed: (s->fd >= 0 && s->qmp_fd >= 0)
../src/tests/qtest/libqtest.c:166: kill_qemu() tried to terminate QEMU process but encountered exit status 1 (expected 0)
ERROR qtest-x86_64: pxe-test - Bail out! ERROR:../src/tests/qtest/libqtest.c:301:qtest_init_without_qmp_handshake: assertion failed: (s->fd >= 0 && s->qmp_fd >= 0)
make: *** [run-test-110] Error 1
socket_accept failed: Resource temporarily unavailable
**
ERROR:../src/tests/qtest/libqtest.c:301:qtest_init_without_qmp_handshake: assertion failed: (s->fd >= 0 && s->qmp_fd >= 0)
../src/tests/qtest/libqtest.c:166: kill_qemu() tried to terminate QEMU process but encountered exit status 1 (expected 0)
ERROR qtest-x86_64: migration-test - Bail out! ERROR:../src/tests/qtest/libqtest.c:301:qtest_init_without_qmp_handshake: assertion failed: (s->fd >= 0 && s->qmp_fd >= 0)
make: *** [run-test-148] Error 1
  TEST    iotest-qcow2: 019
  TEST    iotest-qcow2: 020
  TEST    iotest-qcow2: 021
---
  TEST    iotest-qcow2: 024
socket_accept failed: Resource temporarily unavailable
**
ERROR:../src/tests/qtest/libqtest.c:301:qtest_init_without_qmp_handshake: assertion failed: (s->fd >= 0 && s->qmp_fd >= 0)
../src/tests/qtest/libqtest.c:166: kill_qemu() tried to terminate QEMU process but encountered exit status 1 (expected 0)
ERROR qtest-aarch64: migration-test - Bail out! ERROR:../src/tests/qtest/libqtest.c:301:qtest_init_without_qmp_handshake: assertion failed: (s->fd >= 0 && s->qmp_fd >= 0)
make: *** [run-test-164] Error 1
  TEST    iotest-qcow2: 025

Looking for expected file 'tests/data/acpi/virt/FACP.memhp'
---
    raise CalledProcessError(retcode, cmd)
subprocess.CalledProcessError: Command '['sudo', '-n', 'docker', 'run', '--rm', '--label', 'com.qemu.instance.uuid=0ddbfa81cdf649018b2c11f35a52be9a', '-u', '1001', '--security-opt', 'seccomp=unconfined', '-e', 'TARGET_LIST=', '-e', 'EXTRA_CONFIGURE_OPTS=', '-e', 'V=', '-e', 'J=14', '-e', 'DEBUG=', '-e', 'SHOW_ENV=1', '-e', 'CCACHE_DIR=/var/tmp/ccache', '-v', '/home/patchew/.cache/qemu-docker-ccache:/var/tmp/ccache:z', '-v', '/var/tmp/patchew-tester-tmp-0nxvnmfo/src/docker-src.2020-09-28-14.09.44.31514:/var/tmp/qemu:z,ro', 'qemu/centos7', '/var/tmp/qemu/run', 'test-quick']' returned non-zero exit status 2.
filter=--filter=label=com.qemu.instance.uuid=0ddbfa81cdf649018b2c11f35a52be9a
make[1]: *** [docker-run] Error 1
make[1]: Leaving directory `/var/tmp/patchew-tester-tmp-0nxvnmfo/src'
make: *** [docker-run-test-quick@centos7] Error 2

real    17m14.146s
user    0m22.324s


The full log is available at
http://patchew.org/logs/20200928131638.9486-1-kraxel@redhat.com/testing.docker-quick@centos7/?type=message.
---
Email generated automatically by Patchew [https://patchew.org/].
Please send your feedback to patchew-devel@redhat.com
Peter Maydell Sept. 29, 2020, 9:29 a.m. UTC | #2
On Mon, 28 Sep 2020 at 14:23, Gerd Hoffmann <kraxel@redhat.com> wrote:
>
> The following changes since commit 8d16e72f2d4df2c9e631393adf1669a1da7efe8a:
>
>   Merge remote-tracking branch 'remotes/dgilbert/tags/pull-migration-20200925a' into staging (2020-09-25 14:46:18 +0100)
>
> are available in the Git repository at:
>
>   git://git.kraxel.org/qemu tags/usb-20200928-pull-request
>
> for you to fetch changes up to 5c43b603a2e3f77f41e0cf339e72bee2077bfe61:
>
>   hw/usb: Use lock guard macros (2020-09-28 13:13:58 +0200)
>
> ----------------------------------------------------------------
> usb: xhci sysbus support.
> usb: use lock guards.
>

Applied, thanks.

Please update the changelog at https://wiki.qemu.org/ChangeLog/5.2
for any user-visible changes.

-- PMM