Show patches with: Submitter = Greg Kroah-Hartman       |    State = Action Required       |    Archived = No       |   40 patches
Patch Series A/R/T S/W/F Date Submitter Delegate State
[5.8,211/633] selftests/lkdtm: Use "comm" instead of "diff" for dmesg Untitled series #371501 1 - - --- 2020-10-27 Greg Kroah-Hartman New
[5.9,251/757] selftests/lkdtm: Use "comm" instead of "diff" for dmesg Untitled series #371517 1 - - --- 2020-10-27 Greg Kroah-Hartman New
[5.4,19/65] selftests: tpm: Use /bin/sh instead of /bin/bash Untitled series #314199 - - - --- 2020-07-07 Greg Kroah-Hartman New
[5.7,042/112] selftests: tpm: Use /bin/sh instead of /bin/bash Untitled series #314193 - - - --- 2020-07-07 Greg Kroah-Hartman New
[5.7,041/112] Revert "tpm: selftest: cleanup after unseal with wrong auth/policy test" Untitled series #314193 - - - --- 2020-07-07 Greg Kroah-Hartman New
readfile.2: new page describing readfile(2) readfile(2): a new syscall to make open/read/close faster - - - --- 2020-07-04 Greg Kroah-Hartman New
[3/3] selftests: add readfile(2) selftests readfile(2): a new syscall to make open/read/close faster - - - --- 2020-07-04 Greg Kroah-Hartman New
[2/3] arch: wire up the readfile syscall readfile(2): a new syscall to make open/read/close faster 1 - - --- 2020-07-04 Greg Kroah-Hartman New
[1/3] readfile: implement readfile syscall [1/3] readfile: implement readfile syscall - - - --- 2020-07-04 Greg Kroah-Hartman New
[5.6,056/177] kselftests: dmabuf-heaps: Fix confused return value on expected error testing Untitled series #296727 - - - --- 2020-06-01 Greg Kroah-Hartman New
[5.4,151/177] seccomp: avoid overflow in implicit constant conversion Untitled series #217627 - 2 - --- 2019-12-16 Greg Kroah-Hartman New
[5.3,131/180] seccomp: avoid overflow in implicit constant conversion Untitled series #217649 - 2 - --- 2019-12-16 Greg Kroah-Hartman New
[5.2,121/215] rseq/selftests: Fix Thumb mode build failure on arm32 Untitled series #152329 1 - - --- 2019-07-29 Greg Kroah-Hartman New
[4.19,47/90] kselftest/cgroup: fix incorrect test_core skip Untitled series #136995 1 1 - --- 2019-06-24 Greg Kroah-Hartman New
[4.19,46/90] kselftest/cgroup: fix unexpected testing failure on test_core Untitled series #136995 1 1 - --- 2019-06-24 Greg Kroah-Hartman New
[4.19,45/90] kselftest/cgroup: fix unexpected testing failure on test_memcontrol Untitled series #136995 1 1 - --- 2019-06-24 Greg Kroah-Hartman New
[5.1,059/121] kselftest/cgroup: fix incorrect test_core skip Untitled series #136999 1 1 - --- 2019-06-24 Greg Kroah-Hartman New
[5.1,058/121] kselftest/cgroup: fix unexpected testing failure on test_core Untitled series #136999 1 1 - --- 2019-06-24 Greg Kroah-Hartman New
[5.1,057/121] kselftest/cgroup: fix unexpected testing failure on test_memcontrol Untitled series #136999 1 1 - --- 2019-06-24 Greg Kroah-Hartman New
[5.1,075/122] ftrace/x86_64: Emulate call function while updating in breakpoint handler Untitled series #121873 - 2 1 --- 2019-05-23 Greg Kroah-Hartman New
[5.1,074/122] x86_64: Allow breakpoints to emulate call instructions Untitled series #121873 - 2 1 --- 2019-05-23 Greg Kroah-Hartman New
[5.0,066/139] ftrace/x86_64: Emulate call function while updating in breakpoint handler Untitled series #121881 - 2 1 --- 2019-05-23 Greg Kroah-Hartman New
[5.0,065/139] x86_64: Allow breakpoints to emulate call instructions Untitled series #121881 - 2 1 --- 2019-05-23 Greg Kroah-Hartman New
[4.19,053/114] ftrace/x86_64: Emulate call function while updating in breakpoint handler Untitled series #121891 - 2 1 --- 2019-05-23 Greg Kroah-Hartman New
[4.14,34/77] ftrace/x86_64: Emulate call function while updating in breakpoint handler Untitled series #121903 - 2 1 --- 2019-05-23 Greg Kroah-Hartman New
[4.19,052/114] x86_64: Allow breakpoints to emulate call instructions Untitled series #121891 - 2 1 --- 2019-05-23 Greg Kroah-Hartman New
[4.14,33/77] x86_64: Allow breakpoints to emulate call instructions Untitled series #121903 - 2 1 --- 2019-05-23 Greg Kroah-Hartman New
FAILED: patch "[PATCH] ftrace/x86_64: Emulate call function while updating in" failed to apply to 4… FAILED: patch "[PATCH] ftrace/x86_64: Emulate call function while updating in" failed to apply to 4… - 2 1 --- 2019-05-23 Greg Kroah-Hartman New
FAILED: patch "[PATCH] ftrace/x86_64: Emulate call function while updating in" failed to apply to 4… FAILED: patch "[PATCH] ftrace/x86_64: Emulate call function while updating in" failed to apply to 4… - 2 1 --- 2019-05-23 Greg Kroah-Hartman New
FAILED: patch "[PATCH] x86_64: Allow breakpoints to emulate call instructions" failed to apply to 4… FAILED: patch "[PATCH] x86_64: Allow breakpoints to emulate call instructions" failed to apply to 4… - 2 1 --- 2019-05-23 Greg Kroah-Hartman New
FAILED: patch "[PATCH] x86_64: Allow breakpoints to emulate call instructions" failed to apply to 4… FAILED: patch "[PATCH] x86_64: Allow breakpoints to emulate call instructions" failed to apply to 4… - 2 1 --- 2019-05-23 Greg Kroah-Hartman New
[4.18,001/168] rseq/selftests: fix parametrized test with -fpie [4.18,001/168] rseq/selftests: fix parametrized test with -fpie 1 - - --- 2018-10-08 Greg Kroah-Hartman New
[4.18,218/235] selftest: timers: Tweak raw_skew to SKIP when ADJ_OFFSET/other clock adjustments are… Untitled series #22351 - - - --- 2018-09-24 Greg Kroah-Hartman New
[4.9,098/111] selftest: timers: Tweak raw_skew to SKIP when ADJ_OFFSET/other clock adjustments are … Untitled series #22311 - - - --- 2018-09-24 Greg Kroah-Hartman New
[4.14,151/173] selftest: timers: Tweak raw_skew to SKIP when ADJ_OFFSET/other clock adjustments are… Untitled series #22359 - - - --- 2018-09-24 Greg Kroah-Hartman New
[4.4,62/70] selftest: timers: Tweak raw_skew to SKIP when ADJ_OFFSET/other clock adjustments are in… Untitled series #22317 - - - --- 2018-09-24 Greg Kroah-Hartman New
[4.9,033/107] selftests/ftrace: Add snapshot and tracing_on test case Untitled series #14551 - - - --- 2018-09-03 Greg Kroah-Hartman New
[4.14,054/165] selftests/ftrace: Add snapshot and tracing_on test case Untitled series #14563 - - - --- 2018-09-03 Greg Kroah-Hartman New
[3.18,25/56] selftests/ftrace: Add snapshot and tracing_on test case Untitled series #14531 - - - --- 2018-09-03 Greg Kroah-Hartman New
[4.4,30/80] selftests/ftrace: Add snapshot and tracing_on test case Untitled series #14543 - - - --- 2018-09-03 Greg Kroah-Hartman New